{"text_format":"2","workbook":"xlsx","n_sheets":7,"sheets":["11eV","10.5eV","10eV","9.5eV","16.6eV","13eV","Comparative Graph"],"not_rendered":{"charts":1,"images":0,"macros":0,"external_links":0,"defined_names":0,"comments":0,"pivot_tables":0},"unopened":[],"bounds":{"document_bytes":16777216,"sheet_cells":100000,"run_cost":"one","rows_first":2000,"rows_last":500,"rows_between":2000,"halvings":0,"cell_chars":16384,"cell_head_chars":4096},"cells_cut":0,"cells_raw":0,"read":"whole","date_system":"1900"}

{"sheet":"11eV","index":0,"n_rows":20,"n_cols":51,"rows_kept":20,"cut":false,"hidden":false,"merged":[]}
[]
["","","","","","M/Z",28,30,32,42,43,44,45,55,56,57,58,59,60,61,69,70,71,72,73,74,83,84,85,86,87,97,98,99,100,101,110,111,112,113,114,115,116,117,119,126,128,129,130,144,146]
["Wavelength(Å)","Photon Indensity(nA)","Energy(eV)","Corrected PI(nA)","","Formula"]
["","","","","","Range",9455,9766,10069,11446,11571,11697,11825,13009,13122,13234,13344,13457,13557,13670,14501,14599,14700,14798,14896,14997,15848,15937,16026,16118,16209,17084,17165,17247,17332,17416,18149,18225,18306,18381,18465,18544,18617,18697,18854,19376,19530,19605,19679,20674,20812]
["","","","","","",9475,9779,10087,11462,11590,11716,11840,13023,13146,13254,13361,13469,13578,13680,14516,14623,14723,14818,14919,15008,15861,15954,16050,16136,16225,17097,17188,17268,17359,17440,18174,18249,18333,18411,18492,18567,18637,18720,18877,19407,19559,19628,19700,20703,20839]
["","","","","","Background Deduction","","","","","","","","","","","","","","","","","","","","","","","","","","","","","","","","","","","","","","","","","","","","",""]
[1127,1.21,11.001258867178324,11.225170551321732,"","",0.50066054447059294,0,0,4.7215318250785421,2.066783742298532,0.44542753066778701,0,7.1268404906845662E-2,68.150412192171416,9.8813643403341853,3.3816858128298395,0,0.49175199385723772,0,1.0048845091865275,166.76806748201946,98.386032973900797,4.4115142637337623,0,0.22449547545656429,0.37415912576094068,2.5514088956650838,6.6814129600168046,0,0,0,8.8729164109023166,1.9990787576370277,1323.5504914667529,101.73564800452255,0,0,0.66279616563366683,0.51847764569730403,0,0,0.57371065950010969,0.52382277606531735,0,0,0.6235985429349018,0,0.39553964723299495,3.563420245342315E-2,0]
[1127,0.94,11.001258867178324,8.7203804282995261,"","",1.8026736481570447,0.28439126255912633,0.69721728885463297,3.6214016417811377,0,0,0,0.72244554601713595,49.424449259267575,8.3643139883317339,2.3806300849707536,0.137608675431835,1.4815867388160948,0,0.69263033300690602,139.32878387473343,85.221052694935707,4.0365211460005082,0,0,0.88986943445920252,1.0412389774342217,6.0203795501428026,0.30273908595003812,0,0,6.9492381093076911,0.13302171958410805,1103.3830552592387,83.195911688163875,1.2155432996478799,0,0,1.093988969683092,0,0,0,0.44034776138187354,0.22017388069093677,0,0.80271727335237364,0.39447820290459501,0,0.89445639030693069,0]
{"$rows_left_out":13}
{"sheet":"10.5eV","index":1,"n_rows":21,"n_cols":61,"rows_kept":21,"cut":false,"hidden":false,"merged":[]}
[]
["A",null,null,"","","","","","","M/Z",28,30,32,42,43,44,45,55,56,57,58,59,60,61,69,70,71,72,73,74,83,84,85,86,87,97,98,99,100,101,110,111,112,113,114,115,116,117,119,126,128,129,130,144,146,"","","","","",""]
["B",null,null,"Temperature(K)","Wavelength(Å)","Photon Indensity(nA)","Energy(eV)","Corrected PI(nA)","","Formula","","","","","","","","","","","","","","","","","","","","","","","","","","","","","","","","","","","","","","","","","","","","","","","","","","",""]
["C",null,null,"","","","","","","Range",9455,9766,10069,11446,11571,11697,11825,13009,13122,13234,13344,13457,13557,13670,14501,14599,14700,14798,14896,14997,15848,15937,16026,16118,16209,17084,17165,17247,17332,17416,18149,18225,18306,18381,18465,18544,18617,18697,18854,19376,19530,19605,19679,20674,20812,"","","","","",""]
["D",null,null,"","","","","","","",9475,9779,10087,11462,11590,11716,11840,13023,13146,13254,13361,13469,13578,13680,14516,14623,14723,14818,14919,15008,15861,15954,16050,16136,16225,17097,17188,17268,17359,17440,18174,18249,18333,18411,18492,18567,18637,18720,18877,19407,19559,19628,19700,20703,20839,"","","","","",""]
["E",null,null,"","","","","","","Background Deduction","","","","","","","","","","","","","","","","","","","","","","","","","","","","","","","","","","","","","","","","","","","","","","","","","","",""]
["F",null,null,227,1180,1.69,10.507134528228789,16.405869681889545,"","",0.42423840582393213,0,4.9982111030980519E-2,0,0.25600593454892445,0,4.3886731636958422E-2,0,0.36572276364132073,0.34743662545925469,0.71681661673698871,0,0,0.19139491297229122,0.34865570133805907,2.4076748606386951,0.47300144097610802,0.10727867733478752,0.21699550642718379,8.7773463273917052E-2,0.11703128436522274,7.0706400970655572E-2,0,0,0.15238448485055031,0,5.5467952485600316,0,428.16626830543981,32.275033891346553,0,0,0,0,0.23893887224566288,0.31939788024675347,0.25722501042772894,0,9.7526070304352175E-2,8.7773463273916982E-2,4.8763035152176101E-2,0,0,3.6572276364132079E-2,4.8763035152175876E-3,"","","","","",""]
["G",null,null,247,1180,1.29,10.507134528228789,12.522823603335807,"","",0.12936379616243004,0,0,0.37212054945489115,0.11179587322679121,4.7912517097196398E-2,0.43760098948772608,0,1.277667122591901,0,1.5523655539491594,0,0.40885347922940807,0,0,1.3175942201728978,0.44398932510068545,0,6.3883356129594809E-2,0,0.15970839032398762,0,0,0,0,0,4.2322723435856719,0.15012588690454856,357.95441523315344,27.629551526049855,4.1524181484236741E-2,0.39927097580996901,3.1941678064796842E-3,0,0.30664010942205622,0,0.34497012309981323,4.4718349290716532E-2,0.20123257180822438,0.10860170542031156,0.15970839032398762,4.1524181484236776E-2,0.16929089374342687,7.985419516199381E-2,2.5553342451838022E-2,"","","","","",""]
{"$rows_left_out":14}
{"sheet":"10eV","index":2,"n_rows":21,"n_cols":59,"rows_kept":21,"cut":false,"hidden":false,"merged":[]}
[]
["A",null,null,"","","","","","","M/Z",28,30,32,42,43,44,45,55,56,57,58,59,60,61,69,70,71,72,73,74,83,84,85,86,87,97,98,99,100,101,110,111,112,113,114,115,116,117,119,126,128,129,130,144,146,"","","",""]
["B",null,null,"Temperature(K)","Wavelength(Å)","Photon Indensity(nA)","Energy(eV)","Corrected PI(nA)","","Formula",{"$f":"ROUND(K2,0)","v":28},{"$f":"ROUND(L2,0)","v":30},32,42,43,44,45,55,56,57,58,59,60,61,69,70,71,72,73,74,83,84,85,86,87,97,98,99,100,101,110,111,112,113,114,115,116,117,119,126,128,129,130,144,146,"","","",""]
["C",null,null,"","","","","","","Range",9455,9766,10069,11446,11571,11697,11825,13009,13122,13234,13344,13457,13557,13670,14501,14599,14700,14798,14896,14997,15848,15937,16026,16118,16209,17084,17165,17247,17332,17416,18149,18225,18306,18381,18465,18544,18617,18697,18854,19376,19530,19605,19679,20674,20812,"","","",""]
["D",null,null,"","","","","","","",9475,9779,10087,11462,11590,11716,11840,13023,13146,13254,13361,13469,13578,13680,14516,14623,14723,14818,14919,15008,15861,15954,16050,16136,16225,17097,17188,17268,17359,17440,18174,18249,18333,18411,18492,18567,18637,18720,18877,19407,19559,19628,19700,20703,20839,"","","",""]
["E",null,null,"","","","","","","Background Deduction","","","","","","","","","","","","","","","","","","","","","","","","","","","","","","","","","","","","","","","","","","","","","","","","",""]
["F",null,null,227,1240,2.44,9.9987247929919132,24.934033492739957,"","",2.9678310980670891E-2,0,0,2.6469844928706465E-2,0,2.4063495389733156E-2,0.15079790444232777,0,0,0,1.9186626990747235,5.7752388935359569E-2,0,2.2459262363750947E-2,0,0.18047621542299866,8.1815884325092722E-2,0,3.2084660519644233E-3,0,6.4169321039288423E-3,0,0,0,0,0,0.93205938809566424,6.2565088013306208E-2,5.8666801760169429,0.60158738474332885,0,0,8.0211651299110405E-3,0,7.0586253143217245E-2,6.0960854987323988E-2,0,0.182882564961972,1.6042330259822117E-3,0,0.11229631181875471,0,0,2.4063495389733156E-2,0,"","","",""]
["G",null,null,247,1240,1.87,9.9987247929919132,19.109279766976936,"","",0,0,3.244496954152256E-2,5.1283984114019528E-2,0.219788503345798,6.2796715241656559E-2,3.7678029144993935E-2,3.6631417224299662E-2,2.6165298017356904E-2,0,1.7415622360352756,3.8724641065688216E-2,0,0,9.0008625179707744E-2,0.13082649008678451,0.10675441591081616,3.8724641065688216E-2,0,3.977125298638249E-2,0,0,0,0,5.0237372193325254E-2,0,1.6787655207936187,0,4.5925331080064842,0.34014887422563972,7.7449282131376432E-2,0,0,0,0,0,0,0.10466119206942762,8.163572981415354E-2,5.6517043717490917E-2,0.15699178810414141,0,1.2559343048331313E-2,0,0,"","","",""]
{"$rows_left_out":14}
{"sheet":"9.5eV","index":3,"n_rows":21,"n_cols":57,"rows_kept":21,"cut":false,"hidden":false,"merged":[]}
[]
["A",null,null,"","","","","","","M/Z",28,30,32,42,43,44,45,55,56,57,58,59,60,61,69,70,71,72,73,74,83,84,85,86,87,97,98,99,100,101,110,111,112,113,114,115,116,117,119,126,128,129,130,144,146,"",""]
["B",null,null,"Temperature(K)","Wavelength(Å)","Photon Indensity(nA)","Energy(eV)","Corrected PI(nA)","","Formula","","","","","","","","","","","","","","","","","","","","","","","","","","","","","","","","","","","","","","","","","","","","","","",""]
["C",null,null,"","","","","","","Range",9455,9766,10069,11446,11571,11697,11825,13009,13122,13234,13344,13457,13557,13670,14501,14599,14700,14798,14896,14997,15848,15937,16026,16118,16209,17084,17165,17247,17332,17416,18149,18225,18306,18381,18465,18544,18617,18697,18854,19376,19530,19605,19679,20674,20812,"",""]
["D",null,null,"","","","","","","",9475,9779,10087,11462,11590,11716,11840,13023,13146,13254,13361,13469,13578,13680,14516,14623,14723,14818,14919,15008,15861,15954,16050,16136,16225,17097,17188,17268,17359,17440,18174,18249,18333,18411,18492,18567,18637,18720,18877,19407,19559,19628,19700,20703,20839,"",""]
["E",null,null,"","","","","","","Background Deduction","","","","","","","","","","","","","","","","","","","","","","","","","","","","","","","","","","","","","","","","","","","","","","",""]
["F",null,null,227,1305,3.39,9.5007040178620468,36.830270557770589,"","",0,2.3893389504691928E-2,0,9.883174749668025E-2,0,4.8872842168688035E-2,0,0,0,0,4.4528589531471326E-2,0,7.6024421151292501E-2,0,4.7786779009383856E-2,0.16290947389562679,2.8237642141908645E-2,7.0051073775119529E-2,0,0,2.7151578982604466E-2,1.5204884230258502E-2,0,2.7151578982604466E-2,0,0,0,3.0409768460517003E-2,0.1172948212048513,9.5030526439115637E-2,8.1454736947813397E-2,1.3575789491302233E-2,0,0,0,6.8421979036163261E-2,0.10860631593041786,0,1.737701054886685E-2,0,0,1.4118821070954322E-2,4.5614652690775505E-2,0,0,"",""]
["G",null,null,247,1305,2.6,9.5007040178620468,28.247405147552666,"","",0,1.5576652004020313E-2,0,3.5401481827318899E-2,0,2.8321185461855119E-2,3.6817541100411653E-2,0,0,0,0,2.6197096552215984E-2,0,0,0,0,0.14302198658236834,0,0,0,5.0978133831339215E-2,9.9124149116492921E-3,3.5401481827318899E-2,8.4963556385565346E-3,0,0,1.9824829823298584E-2,0,5.3810252377524709E-2,0,0,1.770074091365945E-2,3.1153304008040627E-2,1.3452563094381181E-2,8.2131437839379859E-2,7.2219022927730553E-2,0.1678030238614916,0,0.10762050475504945,3.8233600373504414E-2,0,0,0,0,5.0978133831339215E-2,"",""]
{"$rows_left_out":14}
{"sheet":"16.6eV","index":4,"n_rows":154,"n_cols":110,"rows_kept":154,"cut":false,"hidden":false,"merged":[]}
[]
["A",null,null,"","","","","","","M/Z",15,18,27,28,29,30,31,32,36,38,40,41,42,43,44,55,56,57,58,69,70,71,72,83,84,85,86,87,97,98,99,100,101,114,128,129,"","","","","","","","","","","","","","","","","","","","","","","","","","","","","","","","","","","","","","","","","","","","","","","","","","","","","","","","","","","","","","","",""]
["B",null,null,"Temperature(K)","Wavelength(Å)","Photon Indensity(nA)","Energy(eV)","Corrected PI(nA)","","Formula","",950,"",950,950,950,950,950,"","","",950,950,950,950,950,950,950,950,950,950,950,950,950,950,950,950,950,950,950,950,950,950,950,950,950,"","","","","","","","","","","","","","","","","","","","","","","","","","","","","","","","","","","","","","","","","","","","","","","","","","","","","","","","","","","","","","","",""]
["C",null,null,"","","","","","","Range",6598,7215,8812,8967,9123,9281,9433,9575,10147,10422,10682,10828,10959,11088,11216,12523,12637,12749,12861,14019,14115,14215,14316,15361,15454,15542,15635,15712,16599,16680,16764,16849,16936,17983,19045,19115,"","","","","","","","","","","","","","","","","","","","","","","","","","","","","","","","","","","","","","","","","","","","","","","","","","","","","","","","","","","","","","","",""]
["D",null,null,"","","","","","","",6610,7226,8826,8987,9145,9296,9445,9590,10161,10435,10713,10850,10977,11108,11235,12546,12657,12769,12878,14033,14137,14237,14337,15381,15474,15566,15653,15740,16615,16700,16782,16873,16955,18000,19067,19142,"","","","","","","","","","","","","","","","","","","","","","","","","","","","","","","","","","","","","","","","","","","","","","","","","","","","","","","","","","","","","","","",""]
["E",null,null,"","","","","","","Background Deduction","","","","","","","","","","","","","","","","","","","","","","","","","","","","","","","","","","","","","","","","","","","","","","","","","","","","","","","","","","","","","","","","","","","","","","","","","","","","","","","","","","","","","","","","","","","","","","","","","","","",""]
["F",null,null,227,745,4.63,16.642172809812042,14.781566062575497,"","",0,13.979574229497821,2.5031177240196447,3.2026376501375675,65.045881872713736,1.669647173751482,4.059109822734569E-2,531.11828386552611,68.396000513077325,10.342611828327657,21298.617390554453,136.91512735744428,73.358938789674113,461.0512831420898,17.021200523333579,37.416874345967166,127.66712214464735,192.38692219493473,9.9745858710663899,2.016024545291498,93.727551880156128,176.35479143174084,9.7959850388660712,2.4205824909573757,1.3124455093508407,9.5389080834262145,0.54527375285400903,0,5.9533610733440191E-2,0.53850856981611817,0.45191422693111422,91.600578333043217,10.283078217594216,0.64675149842237312,0,8.9300416100160304E-2,"","","","","","","","","","","","","","","","","","","","","","","","","","","","","","","","","","","","","","","","","","","","","","","","","","","","","","","","","","","","","","","",""]
["H",null,null,247,745,3.83,16.642172809812042,12.227515770985779,"","",0.30586752616377794,14.874648571836344,3.0259621572352362,2.7757069085557813,71.031599244461944,1.0697185139631591,0.35820849320784681,513.94904064747402,65.687913640306533,10.965432595732446,20848.509605271029,139.27767764904738,74.662753833144194,473.7135578875662,17.403371542152943,45.310920907962441,131.39381948803447,207.01506728017318,10.059279603782002,2.5352655911970898,96.003147490143235,180.13961635826391,7.2459526251632953,1.2676327955985449,1.2627258299381632,8.1373847201325944,0,0.5005104973589094,0.29114662918263351,0.70660305509493093,0,91.146887141585694,6.8533953723327778,0.49723918691865504,0.10141062364788361,0,"","","","","","","","","","","","","","","","","","","","","","","","","","","","","","","","","","","","","","","","","","","","","","","","","","","","","","","","","","","","","","","",""]
{"$rows_left_out":147}
{"sheet":"13eV","index":5,"n_rows":154,"n_cols":110,"rows_kept":154,"cut":false,"hidden":false,"merged":[]}
[]
["A",null,null,"","","","","","","M/Z",15,18,27,28,29,30,31,32,36,38,40,41,42,43,44,55,56,57,58,69,70,71,72,83,84,85,86,87,97,98,99,100,101,114,128,129,"","","","","","","","","","","","","","","","","","","","","","","","","","","","","","","","","","","","","","","","","","","","","","","","","","","","","","","","","","","","","","","",""]
["B",null,null,"Temperature(K)","Wavelength(Å)","Photon Indensity(nA)","Energy(eV)","Corrected PI(nA)","","Formula",{"$f":"ROUND(K2,0)","v":15},{"$f":"ROUND(L2,0)","v":18},27,28,29,30,31,32,36,38,40,41,42,43,44,55,56,57,58,69,70,71,72,83,84,85,86,87,97,98,99,100,101,114,128,129,"","","","","","","","","","","","","","","","","","","","","","","","","","","","","","","","","","","","","","","","","","","","","","","","","","","","","","","","","","","","","","","",""]
["C",null,null,"","","","","","","Range",6598,7215,8812,8967,9123,9281,9433,9575,10147,10422,10682,10828,10959,11088,11216,12523,12637,12749,12861,14019,14115,14215,14316,15361,15454,15542,15635,15712,16599,16680,16764,16849,16936,17983,19045,19115,"","","","","","","","","","","","","","","","","","","","","","","","","","","","","","","","","","","","","","","","","","","","","","","","","","","","","","","","","","","","","","","",""]
["D",null,null,"","","","","","","",6610,7226,8826,8987,9145,9296,9445,9590,10161,10435,10713,10850,10977,11108,11235,12546,12657,12769,12878,14033,14137,14237,14337,15381,15474,15566,15653,15740,16615,16700,16782,16873,16955,18000,19067,19142,"","","","","","","","","","","","","","","","","","","","","","","","","","","","","","","","","","","","","","","","","","","","","","","","","","","","","","","","","","","","","","","",""]
["E",null,null,"","","","","","","Background Deduction","","","","","","","","","","","","","","","","","","","","","","","","","","","","","","","","","","","","","","","","","","","","","","","","","","","","","","","","","","","","","","","","","","","","","","","","","","","","","","","","","","","","","","","","","","","","","","","","","","","",""]
["F",null,null,227,950,7.15,13.050967098221022,52.31359384700184,"","",0,8.1424342828706706,0,0,0.21485811188718737,0,8.4108157678258424E-2,371.63342394061533,0.11660449132667633,1.2233913844110053E-2,0.25385371226528852,4.4860232827122015,59.124594059547007,208.23535908963984,7.3785792872290337,8.5721505066450465,154.64852259359085,195.22382709681324,9.1960801126946734,0.99782859791024736,135.57852707927628,240.68810941998819,12.850197254007373,1.1530463798073971,1.4466603120660448,11.316370305802041,1.4910082497509447,0.17586251150908555,0.17318634285568665,0.99285857041107772,0.11010522459699286,165.90334102036473,12.566523376747064,1.3763153074624083E-2,0,0,"","","","","","","","","","","","","","","","","","","","","","","","","","","","","","","","","","","","","","","","","","","","","","","","","","","","","","","","","","","","","","","",""]
["H",null,null,247,950,4.16,13.050967098221022,30.437000056437434,"","",4.0082793893545028E-2,8.5041232552501587,4.2711173820990593E-2,0.30029240671065704,1.9712849455841747E-2,0,0.15376022575556617,326.33176665186028,0.22998324365148787,0.19187173470352667,0,5.2009067814329324,54.86874517539011,203.1750825815067,5.815290589473336,8.0559844776206884,147.12159515382049,191.45776486495433,7.8325721837878142,0.9626441484269419,127.41268826786985,234.94299657457765,13.848933837710737,1.4810920891155823,1.1426881734569641,11.25275156437637,0.9908992326469821,0.32394782605766714,0.1491605608825364,0.82399710725418784,0.23524000350637903,160.01905545779596,11.755429225500336,0,0,6.5709498186139297E-3,"","","","","","","","","","","","","","","","","","","","","","","","","","","","","","","","","","","","","","","","","","","","","","","","","","","","","","","","","","","","","","","",""]
{"$rows_left_out":147}
{"sheet":"Comparative Graph","index":6,"n_rows":54,"n_cols":10,"rows_kept":54,"cut":false,"hidden":false,"merged":[[1,2,2,2],[1,3,2,3],[1,4,1,9]]}
[15,null,"mass",100,"<= choose m/z here"]
[18,null,"No.","T(℃)","wavelength(A)"]
[27,null,null,null,1127,1180,1240,1305,745,950]
[28,null,1,227,{"$f":"HLOOKUP($D$1,'11eV'!$G$2:$AY$20,'Comparative Graph'!C4+5,FALSE)","v":1323.5504914667529},{"$f":"HLOOKUP($D$1,'10.5eV'!$G$2:$AY$20,'Comparative Graph'!C4+5,FALSE)","v":428.16626830543981},{"$f":"HLOOKUP($D$1,'10eV'!$G$2:$AY$20,'Comparative Graph'!C4+5,FALSE)","v":5.8666801760169429},{"$f":"HLOOKUP($D$1,'9.5eV'!$G$2:$AY$20,'Comparative Graph'!C4+5,FALSE)","v":0.1172948212048513},{"$f":"HLOOKUP($D$1,'16.6eV'!$K$2:$AT$19,'Comparative Graph'!C4+5,FALSE)","v":91.600578333043217},{"$f":"HLOOKUP($D$1,'13eV'!$K$2:$AT$19,'Comparative Graph'!C4+5,FALSE)","v":165.90334102036473}]
[29,null,2,247,{"$f":"HLOOKUP($D$1,'11eV'!$G$2:$AY$20,'Comparative Graph'!C5+5,FALSE)","v":1103.3830552592387},{"$f":"HLOOKUP($D$1,'10.5eV'!$G$2:$AY$20,'Comparative Graph'!C5+5,FALSE)","v":357.95441523315344},{"$f":"HLOOKUP($D$1,'10eV'!$G$2:$AY$20,'Comparative Graph'!C5+5,FALSE)","v":4.5925331080064842},{"$f":"HLOOKUP($D$1,'9.5eV'!$G$2:$AY$20,'Comparative Graph'!C5+5,FALSE)","v":5.3810252377524709E-2},{"$f":"HLOOKUP($D$1,'16.6eV'!$K$2:$AT$19,'Comparative Graph'!C5+5,FALSE)","v":91.146887141585694},{"$f":"HLOOKUP($D$1,'13eV'!$K$2:$AT$19,'Comparative Graph'!C5+5,FALSE)","v":160.01905545779596}]
[30,null,3,267,{"$f":"HLOOKUP($D$1,'11eV'!$G$2:$AY$20,'Comparative Graph'!C6+5,FALSE)","v":966.9852087557631},{"$f":"HLOOKUP($D$1,'10.5eV'!$G$2:$AY$20,'Comparative Graph'!C6+5,FALSE)","v":308.29488193174041},{"$f":"HLOOKUP($D$1,'10eV'!$G$2:$AY$20,'Comparative Graph'!C6+5,FALSE)","v":4.4226476424904559},{"$f":"HLOOKUP($D$1,'9.5eV'!$G$2:$AY$20,'Comparative Graph'!C6+5,FALSE)","v":8.0196624179114481E-2},{"$f":"HLOOKUP($D$1,'16.6eV'!$K$2:$AT$19,'Comparative Graph'!C6+5,FALSE)","v":99.380435383452081},{"$f":"HLOOKUP($D$1,'13eV'!$K$2:$AT$19,'Comparative Graph'!C6+5,FALSE)","v":153.91379402098997}]
[31,null,4,277,{"$f":"HLOOKUP($D$1,'11eV'!$G$2:$AY$20,'Comparative Graph'!C7+5,FALSE)","v":866.76534021874568},{"$f":"HLOOKUP($D$1,'10.5eV'!$G$2:$AY$20,'Comparative Graph'!C7+5,FALSE)","v":284.34174603512832},{"$f":"HLOOKUP($D$1,'10eV'!$G$2:$AY$20,'Comparative Graph'!C7+5,FALSE)","v":5.7645816979272286},{"$f":"HLOOKUP($D$1,'9.5eV'!$G$2:$AY$20,'Comparative Graph'!C7+5,FALSE)","v":0.61637033663308982},{"$f":"HLOOKUP($D$1,'16.6eV'!$K$2:$AT$19,'Comparative Graph'!C7+5,FALSE)","v":86.111677417433469},{"$f":"HLOOKUP($D$1,'13eV'!$K$2:$AT$19,'Comparative Graph'!C7+5,FALSE)","v":136.61363088343032}]
[32,null,5,287,{"$f":"HLOOKUP($D$1,'11eV'!$G$2:$AY$20,'Comparative Graph'!C8+5,FALSE)","v":766.29766854269053},{"$f":"HLOOKUP($D$1,'10.5eV'!$G$2:$AY$20,'Comparative Graph'!C8+5,FALSE)","v":243.31908014645632},{"$f":"HLOOKUP($D$1,'10eV'!$G$2:$AY$20,'Comparative Graph'!C8+5,FALSE)","v":8.0622193143107737},{"$f":"HLOOKUP($D$1,'9.5eV'!$G$2:$AY$20,'Comparative Graph'!C8+5,FALSE)","v":1.3228120498132094},{"$f":"HLOOKUP($D$1,'16.6eV'!$K$2:$AT$19,'Comparative Graph'!C8+5,FALSE)","v":73.917466683137306},{"$f":"HLOOKUP($D$1,'13eV'!$K$2:$AT$19,'Comparative Graph'!C8+5,FALSE)","v":126.0167664333529}]
{"$rows_left_out":46}